Target
Matrix metalloproteinase-15
Ligand
BDBM50104975
Substrate
Meas. Tech.
ChEMBL_497444 (CHEMBL1005438)
Ki
>2000±n/a nM
Citation
 Georgiadis, DYiotakis, A Specific targeting of metzincin family members with small-molecule inhibitors: progress toward a multifarious challenge. Bioorg Med Chem 16:8781-94 (2008)  
Target
Name:
Matrix metalloproteinase-15
Synonyms:
MMP-15 MMP15_HUMAN MT2-MMP MTMMP2 Matrix metalloproteinase-15 Membrane-type-2 matrix metalloproteinase | SMCP-2
Type:
PROTEIN
Mol. Mass.:
75814.08
Organism:
Homo sapiens (Human)
Description:
ChEMBL_106793
Residue:
669
  
Inhibitor
Name:
BDBM50104975
Synonyms:
(8S,11R,12S)-2,10-Dioxo-11-(2'-trifluoromethyl-biphenyl-4-ylmethyl)-1-oxa-3,9-diaza-cyclopentadecane-8,12-dicarboxylic acid 12-hydroxyamide 8-[(2-morpholin-4-yl-2-oxo-ethyl)-amide] 2,10-Dioxo-11-(2'-trifluoromethyl-biphenyl-4-ylmethyl)-1-oxa-3,9-diaza-cyclopentadecane-8,12-dicarboxylic acid 12-hydroxyamide 8-[(2-morpholin-4-yl-2-oxo-ethyl)-amide] | CHEMBL325163
Type:
Small organic molecule
Emp. Form.:
C34H42F3N5O8
Mol. Mass.:
705.7212
SMILES:
ONC(=O)[C@H]1CCCOC(=O)NCCCC[C@H](NC(=O)[C@@H]1Cc1ccc(cc1)-c1ccccc1C(F)(F)F)C(=O)NCC(=O)N1CCOCC1
: