Target
Sodium- and chloride-dependent glycine transporter 2
Ligand
BDBM50263363
Substrate
Meas. Tech.
ChEMBL_536095 (CHEMBL995041)
EC50
6650±n/a nM
Citation
 Jolidon, SAlberati, DDowle, AFischer, HHainzl, DNarquizian, RNorcross, RPinard, E Design, synthesis and structure-activity relationship of simple bis-amides as potent inhibitors of GlyT1. Bioorg Med Chem Lett 18:5533-6 (2008)  
Target
Name:
Sodium- and chloride-dependent glycine transporter 2
Synonyms:
GLYT2 NET1 SLC6A5 | Sodium- and chloride-dependent glycine transporter 2
Type:
Enzyme Catalytic Domain
Mol. Mass.:
87438.56
Organism:
Homo sapiens (Human)
Description:
Glycine-2-transporter 0 HUMAN::Q9Y345
Residue:
797
  
Inhibitor
Name:
BDBM50263363
Synonyms:
CHEMBL476557 | N-(2-(bis(3-fluorophenyl)methylamino)-2-oxoethyl)-4-fluorobenzamide
Type:
Small organic molecule
Emp. Form.:
C22H17F3N2O2
Mol. Mass.:
398.3778
SMILES:
Fc1ccc(cc1)C(=O)NCC(=O)NC(c1cccc(F)c1)c1cccc(F)c1
: