Target
Diacylglycerol lipase-alpha
Ligand
BDBM50274019
Substrate
Meas. Tech.
ChEMBL_537915 (CHEMBL982702)
IC50
43±n/a nM
Citation
 Ortar, GBisogno, TLigresti, AMorera, ENalli, MDi Marzo, V Tetrahydrolipstatin analogues as modulators of endocannabinoid 2-arachidonoylglycerol metabolism. J Med Chem 51:6970-9 (2008)  
Target
Name:
Diacylglycerol lipase-alpha
Synonyms:
C11orf11 DGLA_HUMAN NSDDR | Sn1-specific diacylglycerol lipase alpha
Type:
PROTEIN
Mol. Mass.:
114947.74
Organism:
Homo sapiens (Human)
Description:
ChEMBL_1449471
Residue:
1042
  
Inhibitor
Name:
BDBM50274019
Synonyms:
CHEMBL516323 | N-Formyl-L-alanine-(1S)-1-[[(2S,3S)-3-hexyl-4-oxo-2-oxetanyl]methyl]dodecyl Ester
Type:
Small organic molecule
Emp. Form.:
C26H47NO5
Mol. Mass.:
453.6551
SMILES:
CCCCCCCCCCC[C@@H](C[C@@H]1OC(=O)[C@H]1CCCCCC)OC(=O)[C@H](C)NC=O
: