Target
Cannabinoid receptor 2
Ligand
BDBM50274019
Substrate
Meas. Tech.
ChEMBL_537918 (CHEMBL982705)
Ki
>10000±n/a nM
Citation
 Ortar, GBisogno, TLigresti, AMorera, ENalli, MDi Marzo, V Tetrahydrolipstatin analogues as modulators of endocannabinoid 2-arachidonoylglycerol metabolism. J Med Chem 51:6970-9 (2008)  
Target
Name:
Cannabinoid receptor 2
Synonyms:
CANNABINOID CB2 CB2 CB2B CNR2_HUMAN Cannabinoid CB2 receptor Cannabinoid receptor 2 (CB2R) | hCB2
Type:
G Protein-Coupled Receptor (GPCR)
Mol. Mass.:
39690.94
Organism:
Homo sapiens (Human)
Description:
P34972
Residue:
360
  
Inhibitor
Name:
BDBM50274019
Synonyms:
CHEMBL516323 | N-Formyl-L-alanine-(1S)-1-[[(2S,3S)-3-hexyl-4-oxo-2-oxetanyl]methyl]dodecyl Ester
Type:
Small organic molecule
Emp. Form.:
C26H47NO5
Mol. Mass.:
453.6551
SMILES:
CCCCCCCCCCC[C@@H](C[C@@H]1OC(=O)[C@H]1CCCCCC)OC(=O)[C@H](C)NC=O
: