Target
Vascular endothelial growth factor receptor 2
Ligand
BDBM50245853
Substrate
Meas. Tech.
ChEMBL_559422 (CHEMBL1018103)
Ki
>12500±n/a nM
Citation
 Kopecky, DJHao, XChen, YFu, JJiao, XJaen, JCCardozo, MGLiu, JWang, ZWalker, NPWesche, HLi, SFarrelly, EXiao, SHKayser, F Identification and optimization of N3,N6-diaryl-1H-pyrazolo[3,4-d]pyrimidine-3,6-diamines as a novel class of ACK1 inhibitors. Bioorg Med Chem Lett 18:6352-6 (2008)  
Target
Name:
Vascular endothelial growth factor receptor 2
Synonyms:
CD_antigen=CD309 Fetal liver kinase 1 (FLK-1) KDR Protein-tyrosine kinase receptor Flk-1 VEGFR-2 VEGFR2 Vascular Endothelial Growth Factor Receptor Kinase 2 Vascular endothelial growth factor receptor 2 (KDR) Vascular endothelial growth factor receptor 2 (VEGFR2) Vascular endothelial growth factor receptor-2 (VEGFR-2)
Type:
Receptor Tyrosine Kinase
Mol. Mass.:
151510.97
Organism:
Homo sapiens (Human)
Description:
P35968
Residue:
1356
  
Inhibitor
Name:
BDBM50245853
Synonyms:
CHEMBL502156 | N3-(2,6-dimethylphenyl)-N6-(3-fluoro-4-(2-(pyrrolidin-1-yl)ethoxy)phenyl)-1-(3-methoxy-3-methylbutyl)-1H-pyrazolo[3,4-d]pyrimidine-3,6-diamine
Type:
Small organic molecule
Emp. Form.:
C31H40FN7O2
Mol. Mass.:
561.6934
SMILES:
COC(C)(C)CCn1nc(Nc2c(C)cccc2C)c2cnc(Nc3ccc(OCCN4CCCC4)c(F)c3)nc12
: