Target
Matrix metalloproteinase-14
Ligand
BDBM50273426
Substrate
Meas. Tech.
ChEMBL_561990 (CHEMBL1010053)
IC50
3.9±n/a nM
Citation
 Marques, SMNuti, ERossello, ASupuran, CTTuccinardi, TMartinelli, ASantos, MA Dual inhibitors of matrix metalloproteinases and carbonic anhydrases: iminodiacetyl-based hydroxamate-benzenesulfonamide conjugates. J Med Chem 51:7968-79 (2008)  
Target
Name:
Matrix metalloproteinase-14
Synonyms:
MMP-14 MMP14 MT-MMP 1 MT1MMP Matrix Metalloproteinase-14 (MMP-14) Matrix metalloproteinase-14 Membrane-type matrix metalloproteinase 1 | Membrane-type-1 matrix metalloproteinase
Type:
Protein
Mol. Mass.:
65900.19
Organism:
Homo sapiens (Human)
Description:
P50281
Residue:
582
  
Inhibitor
Name:
BDBM50273426
Synonyms:
CHEMBL515980 | N-(4-Phenoxybenzenesulfonyl)-N-hydroxycarbonylmethyl-D-valinehydroxamicAcid
Type:
Small organic molecule
Emp. Form.:
C19H22N2O7S
Mol. Mass.:
422.452
SMILES:
CC(C)[C@@H](N(CC(O)=O)S(=O)(=O)c1ccc(Oc2ccccc2)cc1)C(=O)NO
: