Target
Integrin alpha-3
Ligand
BDBM50254208
Substrate
Meas. Tech.
ChEMBL_559748 (CHEMBL1013703)
IC50
290±n/a nM
Citation
 Yao, NXiao, WWang, XMarik, JPark, SHTakada, YLam, KS Discovery of targeting ligands for breast cancer cells using the one-bead one-compound combinatorial method. J Med Chem 52:126-33 (2009)  
Target
Name:
Integrin alpha-3
Synonyms:
CD49 antigen-like family member C FRP-2 Galactoprotein B3 ITGA3 Integrin alpha-3 light chain VLA-3 alpha chain
Type:
PROTEIN
Mol. Mass.:
116614.45
Organism:
Homo sapiens (Human)
Description:
ChEMBL_559748
Residue:
1051
  
Inhibitor
Name:
BDBM50254208
Synonyms:
2-((3S,6R,11R,14R,20S,28aS)-11-amino-6-carbamoyl-20-(cyclohexylmethyl)-3-methyl-1,4,12,15,18,21,24-heptaoxohexacosahydropyrrolo[2,1-j][1,2,5,8,11,14,17,20,23]dithiaheptaazacyclohexacosin-14-yl)acetic acid | CHEMBL510395
Type:
Small organic molecule
Emp. Form.:
C31H49N9O10S2
Mol. Mass.:
771.905
SMILES:
C[C@@H]1NC(=O)[C@@H]2CCCN2C(=O)CNC(=O)[C@H](CC2CCCCC2)NC(=O)CNC(=O)[C@@H](CC(O)=O)NC(=O)[C@@H](N)CSSC[C@H](NC1=O)C(N)=O
: