Target
Integrin alpha-3
Ligand
BDBM50254206
Substrate
Meas. Tech.
ChEMBL_559748 (CHEMBL1013703)
IC50
220±n/a nM
Citation
 Yao, NXiao, WWang, XMarik, JPark, SHTakada, YLam, KS Discovery of targeting ligands for breast cancer cells using the one-bead one-compound combinatorial method. J Med Chem 52:126-33 (2009)  
Target
Name:
Integrin alpha-3
Synonyms:
CD49 antigen-like family member C FRP-2 Galactoprotein B3 ITGA3 Integrin alpha-3 light chain VLA-3 alpha chain
Type:
PROTEIN
Mol. Mass.:
116614.45
Organism:
Homo sapiens (Human)
Description:
ChEMBL_559748
Residue:
1051
  
Inhibitor
Name:
BDBM50254206
Synonyms:
2-((3S,6R,11R,14R,20S,28aS)-11-amino-6-carbamoyl-20-(3-chlorobenzyl)-27-hydroxy-3-((R)-1-hydroxyethyl)-1,4,12,15,18,21,24-heptaoxohexacosahydropyrrolo[2,1-j][1,2,5,8,11,14,17,20,23]dithiaheptaazacyclohexacosin-14-yl)acetic acid | CHEMBL2372228
Type:
Small organic molecule
Emp. Form.:
C32H44ClN9O12S2
Mol. Mass.:
846.328
SMILES:
[H][C@@]12C[C@@H](O)CN1C(=O)CNC(=O)[C@H](Cc1cccc(Cl)c1)NC(=O)CNC(=O)[C@@H](CC(O)=O)NC(=O)[C@@H](N)CSSC[C@H](NC(=O)[C@@]([H])(NC2=O)[C@@H](C)O)C(N)=O
: