Target
Retinoic acid receptor RXR-beta
Ligand
BDBM50256175
Substrate
Meas. Tech.
ChEMBL_515110 (CHEMBL1024632)
IC50
3900±n/a nM
Citation
 Morishita, KYakushiji, NOhsawa, FTakamatsu, KMatsuura, NMakishima, MKawahata, MYamaguchi, KTai, ASasaki, KKakuta, H Replacing alkyl sulfonamide with aromatic sulfonamide in sulfonamide-type RXR agonists favors switch towards antagonist activity. Bioorg Med Chem Lett 19:1001-3 (2009)  
Target
Name:
Retinoic acid receptor RXR-beta
Synonyms:
NR2B2 RXRB Retinoic acid receptor RXR-beta Retinoid receptor
Type:
PROTEIN
Mol. Mass.:
56932.89
Organism:
Homo sapiens (Human)
Description:
ChEMBL_39045
Residue:
533
  
Inhibitor
Name:
BDBM50256175
Synonyms:
6-(4-methoxy-N-(5,5,8,8-tetramethyl-5,6,7,8-tetrahydronaphthalen-2-yl)phenylsulfonamido)nicotinic acid | CHEMBL471967
Type:
Small organic molecule
Emp. Form.:
C27H30N2O5S
Mol. Mass.:
494.603
SMILES:
COc1ccc(cc1)S(=O)(=O)N(c1ccc2c(c1)C(C)(C)CCC2(C)C)c1ccc(cn1)C(O)=O
: