Target
Baculoviral IAP repeat-containing protein 3
Ligand
BDBM50255244
Substrate
Meas. Tech.
ChEMBL_516266 (CHEMBL985936)
Ki
2.09±n/a nM
Citation
 Sun, WNikolovska-Coleska, ZQin, DSun, HYang, CYBai, LQiu, SWang, YMa, DWang, S Design, synthesis, and evaluation of potent, nonpeptidic mimetics of second mitochondria-derived activator of caspases. J Med Chem 52:593-6 (2009)  
Target
Name:
Baculoviral IAP repeat-containing protein 3
Synonyms:
API2 BIRC3_HUMAN Baculoviral IAP repeat-containing protein 3 (IAP1 BIR3) MIHC XIAP-BIR3 | cIAP1/cIAP2
Type:
Protein
Mol. Mass.:
68365.75
Organism:
Homo sapiens (Human)
Description:
Q13489
Residue:
604
  
Inhibitor
Name:
BDBM50255244
Synonyms:
(1S,3S,6S,10aS,Z)-1-benzyl-6-((S)-2-(methylamino)propanamido)-5-oxo-N-((R)-1,2,3,4-tetrahydronaphthalen-1-yl)-1,2,3,5,6,7,10,10a-octahydropyrrolo[1,2-a]azocine-3-carboxamide | CHEMBL472832
Type:
Small organic molecule
Emp. Form.:
C32H40N4O3
Mol. Mass.:
528.685
SMILES:
CN[C@@H](C)C(=O)N[C@H]1C\C=C/C[C@H]2[C@@H](Cc3ccccc3)C[C@H](N2C1=O)C(=O)N[C@@H]1CCCc2ccccc12
: