Target
C-X-C chemokine receptor type 1
Ligand
BDBM50248038
Substrate
Meas. Tech.
ChEMBL_566227 (CHEMBL963308)
Ki
14±n/a nM
Citation
 Biju, PTaveras, AGYu, YZheng, JHipkin, RWFossetta, JFan, XFine, JLundell, D 3,4-Diamino-1,2,5-thiadiazole as potent and selective CXCR2 antagonists. Bioorg Med Chem Lett 19:1434-7 (2009)  
Target
Name:
C-X-C chemokine receptor type 1
Synonyms:
C-X-C chemokine receptor type 1 (CXCR-1) CMKAR1 CXCR1_HUMAN Interleukin-8 receptor A | Interleukin-8 receptors, CXCR1/CXCR2
Type:
Enzyme
Mol. Mass.:
39803.83
Organism:
Homo sapiens (Human)
Description:
P25024
Residue:
350
  
Inhibitor
Name:
BDBM50248038
Synonyms:
(R)-3-(4-(2,2-dimethyl-1-(5-methylfuran-2-yl)propylamino)-1,2,5-thiadiazol-3-ylamino)-2-hydroxy-N,N-dimethylbenzamide | CHEMBL455431
Type:
Small organic molecule
Emp. Form.:
C21H27N5O3S
Mol. Mass.:
429.536
SMILES:
CN(C)C(=O)c1cccc(Nc2nsnc2N[C@@H](c2ccc(C)o2)C(C)(C)C)c1O
: