Target
Sodium-dependent noradrenaline transporter
Ligand
BDBM50257333
Substrate
Meas. Tech.
ChEMBL_566868 (CHEMBL958368)
Ki
3404±n/a nM
Citation
 Cho, SJJensen, NHKurome, TKadari, SManzano, MLMalberg, JECaldarone, BRoth, BLKozikowski, AP Selective 5-hydroxytryptamine 2C receptor agonists derived from the lead compound tranylcypromine: identification of drugs with antidepressant-like action. J Med Chem 52:1885-902 (2009)  
Target
Name:
Sodium-dependent noradrenaline transporter
Synonyms:
Monoamine transporter NET Noradrenaline Transporter (NET) Norepinephrine transporter protein (NET) SLC6A2 Sodium-dependent noradrenaline transporter (NET) | Solute carrier family 6 member 2
Type:
Multi-pass membrane protein
Mol. Mass.:
69337.72
Organism:
Homo sapiens (Human)
Description:
P23975
Residue:
617
  
Inhibitor
Name:
BDBM50257333
Synonyms:
(+)-(S,S)-trans-[2-(2-Bromophenyl)cyclopropyl]methylamine Hydrochloride | CHEMBL467736
Type:
Small organic molecule
Emp. Form.:
C10H12BrN
Mol. Mass.:
226.113
SMILES:
NC[C@H]1C[C@@H]1c1ccccc1Br
: