Target
Coagulation factor X
Ligand
BDBM50193861
Substrate
Meas. Tech.
ChEMBL_499722 (CHEMBL968695)
IC50
0.5±n/a nM
Citation
 Zhang, PHuang, WWang, LBao, LJia, ZJBauer, SMGoldman, EAProbst, GDSong, YSu, TFan, JWu, YLi, WWoolfrey, JSinha, UWong, PWEdwards, STArfsten, AEClizbe, LAKanter, JPandey, APark, GHutchaleelaha, ALambing, JLHollenbach, SJScarborough, RMZhu, BY Discovery of betrixaban (PRT054021), N-(5-chloropyridin-2-yl)-2-(4-(N,N-dimethylcarbamimidoyl)benzamido)-5-methoxybenzamide, a highly potent, selective, and orally efficacious factor Xa inhibitor. Bioorg Med Chem Lett 19:2179-85 (2009)  
Target
Name:
Coagulation factor X
Synonyms:
Activated coagulation factor X (FXa) Coagulation factor X precursor F10 Factor X heavy chain Factor Xa Stuart-Prower factor
Type:
Enzyme
Mol. Mass.:
54726.60
Organism:
Homo sapiens (Human)
Description:
Residue:
488
  
Inhibitor
Name:
BDBM50193861
Synonyms:
5-chloro-N-(5-chloro-pyridin-2-yl)-2-[4-(N,N-dimethyl-carbamimidoyl)-benzoylamino]-benzamide CHEMBL221906
Type:
Small organic molecule
Emp. Form.:
C22H19Cl2N5O2
Mol. Mass.:
456.325
SMILES:
CN(C)C(=N)c1ccc(cc1)C(=O)Nc1ccc(Cl)cc1C(=O)Nc1ccc(Cl)cn1
: