Target
5-hydroxytryptamine receptor 2B
Ligand
BDBM50249482
Substrate
Meas. Tech.
ChEMBL_499778 (CHEMBL968751)
IC50
300±n/a nM
Citation
 Moss, NChoi, YCogan, DFlegg, AKahrs, ALoke, PMeyn, ONagaraja, RNapier, SParker, AThomas Peterson, JRamsden, PSarko, CSkow, DTomlinson, JTye, HWhitaker, M A new class of 5-HT2B antagonists possesses favorable potency, selectivity, and rat pharmacokinetic properties. Bioorg Med Chem Lett 19:2206-10 (2009)  
Target
Name:
5-hydroxytryptamine receptor 2B
Synonyms:
5-HT-2B 5-hydroxytryptamine (serotonin) receptor 2B [Homo sapiens] 5-hydroxytryptamine receptor 2C (5HT2C) HTR2B Serotonin 2b (5-HT2b) receptor | Serotonin Receptor 2B
Type:
G Protein-Coupled Receptor (GPCR)
Mol. Mass.:
54312.47
Organism:
Homo sapiens (Human)
Description:
Receptor binding assays were performed using human clone stably expressed in CHO cells.
Residue:
481
  
Inhibitor
Name:
BDBM50249482
Synonyms:
(4-((1H-benzo[d]imidazol-2-yl)methyl)piperidin-1-yl)(biphenyl-4-yl)methanone | CHEMBL475406
Type:
Small organic molecule
Emp. Form.:
C26H25N3O
Mol. Mass.:
395.4962
SMILES:
O=C(N1CCC(Cc2nc3ccccc3[nH]2)CC1)c1ccc(cc1)-c1ccccc1
: