Target
Cannabinoid receptor 1
Ligand
BDBM50267907
Substrate
Meas. Tech.
ChEMBL_563052 (CHEMBL1011882)
IC50
0.2±n/a nM
Citation
 Vachal, PFletcher, JMFong, TMHuang, CCLao, JXiao, JCShen, CPStrack, AMShearman, LStribling, SChen, RZFrassetto, ATong, XWang, JBall, RGTsou, NNHickey, GJThompson, DFFaidley, TDNicolich, SAchanfuo-Yeboah, JHora, DFHale, JJHagmann, WK 1-Sulfonyl-4-acylpiperazines as selective cannabinoid-1 receptor (CB1R) inverse agonists for the treatment of obesity. J Med Chem 52:2550-8 (2009)  
Target
Name:
Cannabinoid receptor 1
Synonyms:
CANN6 CB-R CNR CNR1_HUMAN Cannabinoid receptor Cannabinoid receptor 1 (brain)
Type:
G Protein-Coupled Receptor (GPCR)
Mol. Mass.:
52868.96
Organism:
Homo sapiens (Human)
Description:
P21554
Residue:
472
  
Inhibitor
Name:
BDBM50267907
Synonyms:
(4-(3-(4H-1,2,4-triazol-3-yl)-5-(trifluoromethyl)phenylsulfonyl)piperazin-1-yl)((1R,2R)-2-(4-(trifluoromethyl)phenyl)cyclopropyl)methanone | CHEMBL529213
Type:
Small organic molecule
Emp. Form.:
C24H21F6N5O3S
Mol. Mass.:
573.511
SMILES:
FC(F)(F)c1ccc(cc1)[C@@H]1C[C@H]1C(=O)N1CCN(CC1)S(=O)(=O)c1cc(cc(c1)C(F)(F)F)-c1nnc[nH]1
: