Target
Muscarinic acetylcholine receptor M5
Ligand
BDBM50258362
Substrate
Meas. Tech.
ChEMBL_519771 (CHEMBL957801)
EC50
4660±n/a nM
Citation
 Bridges, TMMarlo, JENiswender, CMJones, CKJadhav, SBGentry, PRPlumley, HCWeaver, CDConn, PJLindsley, CW Discovery of the first highly M5-preferring muscarinic acetylcholine receptor ligand, an M5 positive allosteric modulator derived from a series of 5-trifluoromethoxy N-benzyl isatins. J Med Chem 52:3445-8 (2009)  
Target
Name:
Muscarinic acetylcholine receptor M5
Synonyms:
ACM5_HUMAN | CHRM5
Type:
PROTEIN
Mol. Mass.:
60102.35
Organism:
Homo sapiens (Human)
Description:
ChEMBL_1517990
Residue:
532
  
Inhibitor
Name:
BDBM50258362
Synonyms:
1-(4-bromo-2-fluorobenzyl)-7-chloroindoline-2,3-dione | CHEMBL494846
Type:
Small organic molecule
Emp. Form.:
C15H8BrClFNO2
Mol. Mass.:
368.585
SMILES:
Fc1cc(Br)ccc1CN1C(=O)C(=O)c2cccc(Cl)c12
: