Target
Muscarinic acetylcholine receptor M3
Ligand
BDBM50258439
Substrate
Meas. Tech.
ChEMBL_519767 (CHEMBL955373)
EC50
6380±n/a nM
Citation
 Bridges, TMMarlo, JENiswender, CMJones, CKJadhav, SBGentry, PRPlumley, HCWeaver, CDConn, PJLindsley, CW Discovery of the first highly M5-preferring muscarinic acetylcholine receptor ligand, an M5 positive allosteric modulator derived from a series of 5-trifluoromethoxy N-benzyl isatins. J Med Chem 52:3445-8 (2009)  
Target
Name:
Muscarinic acetylcholine receptor M3
Synonyms:
ACM3_HUMAN Cholinergic, muscarinic M3 Muscarinic receptor M3 | RecName: Full=Muscarinic acetylcholine receptor M3
Type:
Enzyme
Mol. Mass.:
66151.03
Organism:
Homo sapiens (Human)
Description:
P20309
Residue:
590
  
Inhibitor
Name:
BDBM50258439
Synonyms:
1-(4-bromobenzyl)indoline-2,3-dione CVD-0005886 VU0119498 | cid_3008304
Type:
Small organic molecule
Emp. Form.:
C15H10BrNO2
Mol. Mass.:
316.149
SMILES:
Brc1ccc(CN2C(=O)C(=O)c3ccccc23)cc1
: