Target
Muscarinic acetylcholine receptor M5
Ligand
BDBM50258573
Substrate
Meas. Tech.
ChEMBL_519771 (CHEMBL957801)
EC50
3960±n/a nM
Citation
 Bridges, TMMarlo, JENiswender, CMJones, CKJadhav, SBGentry, PRPlumley, HCWeaver, CDConn, PJLindsley, CW Discovery of the first highly M5-preferring muscarinic acetylcholine receptor ligand, an M5 positive allosteric modulator derived from a series of 5-trifluoromethoxy N-benzyl isatins. J Med Chem 52:3445-8 (2009)  
Target
Name:
Muscarinic acetylcholine receptor M5
Synonyms:
ACM5_HUMAN | CHRM5
Type:
PROTEIN
Mol. Mass.:
60102.35
Organism:
Homo sapiens (Human)
Description:
ChEMBL_1517990
Residue:
532
  
Inhibitor
Name:
BDBM50258573
Synonyms:
7-chloro-1-(4-methoxybenzyl)indoline-2,3-dione | CHEMBL511254
Type:
Small organic molecule
Emp. Form.:
C16H12ClNO3
Mol. Mass.:
301.724
SMILES:
COc1ccc(CN2C(=O)C(=O)c3cccc(Cl)c23)cc1
: