Target
Muscarinic acetylcholine receptor M1
Ligand
BDBM50258658
Substrate
Meas. Tech.
ChEMBL_519763 (CHEMBL939026)
EC50
6210±n/a nM
Citation
 Bridges, TMMarlo, JENiswender, CMJones, CKJadhav, SBGentry, PRPlumley, HCWeaver, CDConn, PJLindsley, CW Discovery of the first highly M5-preferring muscarinic acetylcholine receptor ligand, an M5 positive allosteric modulator derived from a series of 5-trifluoromethoxy N-benzyl isatins. J Med Chem 52:3445-8 (2009)  
Target
Name:
Muscarinic acetylcholine receptor M1
Synonyms:
ACM1_RAT Chrm-1 cholinergic receptor, muscarinic 1
Type:
Enzyme Catalytic Domain
Mol. Mass.:
51390.46
Organism:
RAT
Description:
P08482
Residue:
460
  
Inhibitor
Name:
BDBM50258658
Synonyms:
5-fluoro-1-(2-(trifluoromethyl)benzyl)indoline-2,3-dione | CHEMBL467281
Type:
Small organic molecule
Emp. Form.:
C16H9F4NO2
Mol. Mass.:
323.2418
SMILES:
Fc1ccc2N(Cc3ccccc3C(F)(F)F)C(=O)C(=O)c2c1
: