Target
Muscarinic acetylcholine receptor M2
Ligand
BDBM50280565
Substrate
Meas. Tech.
ChEBML_139630
IC50
20±n/a nM
Citation
 Tecle, HMirzadegan, TMoos, WHMoreland, DWPavia, MRSchwarz, RDDavis, RE A rationale for the design and synthesis of m1 selective muscarinic agonists. Bioorg Med Chem Lett 2:821-826 (1992)    Article 
Target
Name:
Muscarinic acetylcholine receptor M2
Synonyms:
ACM2_HUMAN Cholinergic, muscarinic M2 Muscarinic acetylcholine receptor M2 and M5 | RecName: Full=Muscarinic acetylcholine receptor M2
Type:
GPCR
Mol. Mass.:
51730.61
Organism:
Homo sapiens (Human)
Description:
P08172
Residue:
466
  
Inhibitor
Name:
BDBM50280565
Synonyms:
5-(1-Aza-bicyclo[2.2.1]hept-3-yl)-[1,2,4]oxadiazol-3-ylamine | CHEMBL314737
Type:
Small organic molecule
Emp. Form.:
C8H12N4O
Mol. Mass.:
180.2071
SMILES:
Nc1noc(n1)C1CN2CCC1C2
: