Target
Muscarinic acetylcholine receptor M1
Ligand
BDBM50280574
Substrate
Meas. Tech.
ChEMBL_138283 (CHEMBL744240)
IC50
3840±n/a nM
Citation
 Tecle, HMirzadegan, TMoos, WHMoreland, DWPavia, MRSchwarz, RDDavis, RE A rationale for the design and synthesis of m1 selective muscarinic agonists. Bioorg Med Chem Lett 2:821-826 (1992)    Article 
Target
Name:
Muscarinic acetylcholine receptor M1
Synonyms:
ACM1_HUMAN Cholinergic receptor, muscarinic 1 | Cholinergic, muscarinic M1
Type:
Protein
Mol. Mass.:
51442.54
Organism:
Homo sapiens (Human)
Description:
P11229
Residue:
460
  
Inhibitor
Name:
BDBM50280574
Synonyms:
1-Aza-bicyclo[2.2.1]heptan-3-one O-tert-butyl-oxime | CHEMBL166593
Type:
Small organic molecule
Emp. Form.:
C10H18N2O
Mol. Mass.:
182.2627
SMILES:
CC(C)(C)O\N=C1/CN2CCC1C2
: