Target
Muscarinic acetylcholine receptor M2
Ligand
BDBM50065210
Substrate
Meas. Tech.
ChEBML_139630
IC50
2180±n/a nM
Citation
 Tecle, HMirzadegan, TMoos, WHMoreland, DWPavia, MRSchwarz, RDDavis, RE A rationale for the design and synthesis of m1 selective muscarinic agonists. Bioorg Med Chem Lett 2:821-826 (1992)    Article 
Target
Name:
Muscarinic acetylcholine receptor M2
Synonyms:
ACM2_HUMAN Cholinergic, muscarinic M2 Muscarinic acetylcholine receptor M2 and M5 | RecName: Full=Muscarinic acetylcholine receptor M2
Type:
GPCR
Mol. Mass.:
51730.61
Organism:
Homo sapiens (Human)
Description:
P08172
Residue:
466
  
Inhibitor
Name:
BDBM50065210
Synonyms:
1-Aza-bicyclo[2.2.1]heptan-3-one O-nona-2,5,8-triynyl-oxime | CHEMBL83074
Type:
Small organic molecule
Emp. Form.:
C15H16N2O
Mol. Mass.:
240.3003
SMILES:
C#CCC#CCC#CCO\N=C1/CN2CCC1C2
: