Target
Muscarinic acetylcholine receptor M1
Ligand
BDBM50280565
Substrate
Meas. Tech.
ChEMBL_138283 (CHEMBL744240)
IC50
400±n/a nM
Citation
 Tecle, HMirzadegan, TMoos, WHMoreland, DWPavia, MRSchwarz, RDDavis, RE A rationale for the design and synthesis of m1 selective muscarinic agonists. Bioorg Med Chem Lett 2:821-826 (1992)    Article 
Target
Name:
Muscarinic acetylcholine receptor M1
Synonyms:
ACM1_HUMAN Cholinergic receptor, muscarinic 1 | Cholinergic, muscarinic M1
Type:
Protein
Mol. Mass.:
51442.54
Organism:
Homo sapiens (Human)
Description:
P11229
Residue:
460
  
Inhibitor
Name:
BDBM50280565
Synonyms:
5-(1-Aza-bicyclo[2.2.1]hept-3-yl)-[1,2,4]oxadiazol-3-ylamine | CHEMBL314737
Type:
Small organic molecule
Emp. Form.:
C8H12N4O
Mol. Mass.:
180.2071
SMILES:
Nc1noc(n1)C1CN2CCC1C2
: