Target
Substance-K receptor
Ligand
BDBM50281766
Substrate
Meas. Tech.
ChEBML_142867
Ki
1.4±n/a nM
Citation
 Emonds-Alt, XProietto, VBroeck, DVVilain, PAdvenier, CNeliat, GFur, GLBrelère, JC Pharmacological profile and chemical synthesis of SR 48968, a non-peptide antagonist of the neurokinin A (NK2) receptor Bioorg Med Chem Lett 3:925-930 (1993)    Article 
Target
Name:
Substance-K receptor
Synonyms:
NK-2 receptor NK2R_RAT Neurokinin A receptor SKR Tac2r Tacr2
Type:
Enzyme Catalytic Domain
Mol. Mass.:
43868.63
Organism:
Rattus norvegicus (Rat)
Description:
Neurokinin NK2 TACR2 Murine::P16610
Residue:
390
  
Inhibitor
Name:
BDBM50281766
Synonyms:
CHEMBL173008 | Thiophene-2-carboxylic acid [2-(3,4-dichloro-phenyl)-4-(4-hydroxy-4-phenyl-piperidin-1-yl)-butyl]-methyl-amide
Type:
Small organic molecule
Emp. Form.:
C27H30Cl2N2O2S
Mol. Mass.:
517.51
SMILES:
CN(CC(CCN1CCC(O)(CC1)c1ccccc1)c1ccc(Cl)c(Cl)c1)C(=O)c1cccs1
: