Target
Substance-K receptor
Ligand
BDBM50281767
Substrate
Meas. Tech.
ChEBML_142867
Ki
0.300000±n/a nM
Citation
 Emonds-Alt, XProietto, VBroeck, DVVilain, PAdvenier, CNeliat, GFur, GLBrelère, JC Pharmacological profile and chemical synthesis of SR 48968, a non-peptide antagonist of the neurokinin A (NK2) receptor Bioorg Med Chem Lett 3:925-930 (1993)    Article 
Target
Name:
Substance-K receptor
Synonyms:
NK-2 receptor NK2R_RAT Neurokinin A receptor SKR Tac2r Tacr2
Type:
Enzyme Catalytic Domain
Mol. Mass.:
43868.63
Organism:
Rattus norvegicus (Rat)
Description:
Neurokinin NK2 TACR2 Murine::P16610
Residue:
390
  
Inhibitor
Name:
BDBM50281767
Synonyms:
Acetic acid 1-{3-(3,4-dichloro-phenyl)-4-[ethyl-(thiophene-2-carbonyl)-amino]-butyl}-4-phenyl-piperidin-4-yl ester | CHEMBL368995
Type:
Small organic molecule
Emp. Form.:
C30H34Cl2N2O3S
Mol. Mass.:
573.574
SMILES:
CCN(CC(CCN1CCC(CC1)(OC(C)=O)c1ccccc1)c1ccc(Cl)c(Cl)c1)C(=O)c1cccs1
: