Target
Substance-K receptor
Ligand
BDBM50071484
Substrate
Meas. Tech.
ChEBML_142867
Ki
0.500000±n/a nM
Citation
 Emonds-Alt, XProietto, VBroeck, DVVilain, PAdvenier, CNeliat, GFur, GLBrelère, JC Pharmacological profile and chemical synthesis of SR 48968, a non-peptide antagonist of the neurokinin A (NK2) receptor Bioorg Med Chem Lett 3:925-930 (1993)    Article 
Target
Name:
Substance-K receptor
Synonyms:
NK-2 receptor NK2R_RAT Neurokinin A receptor SKR Tac2r Tacr2
Type:
Enzyme Catalytic Domain
Mol. Mass.:
43868.63
Organism:
Rattus norvegicus (Rat)
Description:
Neurokinin NK2 TACR2 Murine::P16610
Residue:
390
  
Inhibitor
Name:
BDBM50071484
Synonyms:
CHEMBL308148 N-[(S)-4-(4-Acetylamino-4-phenyl-piperidin-1-yl)-2-(3,4-dichloro-phenyl)-butyl]-N-methyl-benzamide | Saredutant
Type:
Small organic molecule
Emp. Form.:
C31H35Cl2N3O2
Mol. Mass.:
552.535
SMILES:
CN(C[C@@H](CCN1CCC(CC1)(NC(C)=O)c1ccccc1)c1ccc(Cl)c(Cl)c1)C(=O)c1ccccc1
: