Target
Substance-K receptor
Ligand
BDBM50281770
Substrate
Meas. Tech.
ChEBML_142867
Ki
23±n/a nM
Citation
 Emonds-Alt, XProietto, VBroeck, DVVilain, PAdvenier, CNeliat, GFur, GLBrelère, JC Pharmacological profile and chemical synthesis of SR 48968, a non-peptide antagonist of the neurokinin A (NK2) receptor Bioorg Med Chem Lett 3:925-930 (1993)    Article 
Target
Name:
Substance-K receptor
Synonyms:
NK-2 receptor NK2R_RAT Neurokinin A receptor SKR Tac2r Tacr2
Type:
Enzyme Catalytic Domain
Mol. Mass.:
43868.63
Organism:
Rattus norvegicus (Rat)
Description:
Neurokinin NK2 TACR2 Murine::P16610
Residue:
390
  
Inhibitor
Name:
BDBM50281770
Synonyms:
CHEMBL367542 | N-[4-[4-(Acetylamino-methyl)-4-phenyl-piperidin-1-yl]-2-(3,4-dichloro-phenyl)-butyl]-N-methyl-benzamide
Type:
Small organic molecule
Emp. Form.:
C32H37Cl2N3O2
Mol. Mass.:
566.561
SMILES:
CN(CC(CCN1CCC(CNC(C)=O)(CC1)c1ccccc1)c1ccc(Cl)c(Cl)c1)C(=O)c1ccccc1
: