Target
72 kDa type IV collagenase
Ligand
BDBM50101530
Substrate
Meas. Tech.
ChEBML_101923
Ki
0.060000±n/a nM
Citation
 Porter, JRBeeley, NRBoyce, BAMason, BMillican, AMillar, KLeonard, JMorphy, JRO'Connell, JP Potent and selective inhibitors of gelatinase-a 1. hydroxamic acid derivatives Bioorg Med Chem Lett 4:2741-2746 (1994)    Article 
Target
Name:
72 kDa type IV collagenase
Synonyms:
72 kDa gelatinase CLG4A Gelatinase A (MMP-2) MMP2_HUMAN Matrix metalloproteinase-2 (MMP 2) Matrix metalloproteinases 2 (MMP-2) | TBE-1
Type:
Enzyme
Mol. Mass.:
73870.36
Organism:
Homo sapiens (Human)
Description:
P08253
Residue:
660
  
Inhibitor
Name:
BDBM50101530
Synonyms:
(R)-N*1*-((S)-2-Cyclohexyl-1-phenethylcarbamoyl-ethyl)-N*4*-hydroxy-2-[3-(4-methoxy-phenyl)-propyl]-succinamide N*1*-(2-Cyclohexyl-1-phenethylcarbamoyl-ethyl)-N*4*-hydroxy-2-[3-(4-methoxy-phenyl)-propyl]-succinamide
Type:
Small organic molecule
Emp. Form.:
C31H43N3O5
Mol. Mass.:
537.6902
SMILES:
COc1ccc(CCC[C@H](CC(=O)NO)C(=O)N[C@@H](CC2CCCCC2)C(=O)NCCc2ccccc2)cc1
: