Target
72 kDa type IV collagenase
Ligand
BDBM50101492
Substrate
Meas. Tech.
ChEBML_101923
Ki
0.062000±n/a nM
Citation
 Porter, JRBeeley, NRBoyce, BAMason, BMillican, AMillar, KLeonard, JMorphy, JRO'Connell, JP Potent and selective inhibitors of gelatinase-a 1. hydroxamic acid derivatives Bioorg Med Chem Lett 4:2741-2746 (1994)    Article 
Target
Name:
72 kDa type IV collagenase
Synonyms:
72 kDa gelatinase CLG4A Gelatinase A (MMP-2) MMP2_HUMAN Matrix metalloproteinase-2 (MMP 2) Matrix metalloproteinases 2 (MMP-2) | TBE-1
Type:
Enzyme
Mol. Mass.:
73870.36
Organism:
Homo sapiens (Human)
Description:
P08253
Residue:
660
  
Inhibitor
Name:
BDBM50101492
Synonyms:
(R)-N*1*-((S)-2-Cyclohexyl-1-phenethylcarbamoyl-ethyl)-N*4*-hydroxy-2-(3-phenyl-propyl)-succinamide N*1*-(2-Cyclohexyl-1-phenethylcarbamoyl-ethyl)-N*4*-hydroxy-2-(3-phenyl-propyl)-succinamide
Type:
Small organic molecule
Emp. Form.:
C30H41N3O4
Mol. Mass.:
507.6642
SMILES:
ONC(=O)C[C@@H](CCCc1ccccc1)C(=O)N[C@@H](CC1CCCCC1)C(=O)NCCc1ccccc1
: