Target
72 kDa type IV collagenase
Ligand
BDBM50283714
Substrate
Meas. Tech.
ChEBML_101923
Ki
0.050000±n/a nM
Citation
 Porter, JRBeeley, NRBoyce, BAMason, BMillican, AMillar, KLeonard, JMorphy, JRO'Connell, JP Potent and selective inhibitors of gelatinase-a 1. hydroxamic acid derivatives Bioorg Med Chem Lett 4:2741-2746 (1994)    Article 
Target
Name:
72 kDa type IV collagenase
Synonyms:
72 kDa gelatinase CLG4A Gelatinase A (MMP-2) MMP2_HUMAN Matrix metalloproteinase-2 (MMP 2) Matrix metalloproteinases 2 (MMP-2) | TBE-1
Type:
Enzyme
Mol. Mass.:
73870.36
Organism:
Homo sapiens (Human)
Description:
P08253
Residue:
660
  
Inhibitor
Name:
BDBM50283714
Synonyms:
(R)-2-[3-(4-Chloro-phenyl)-propyl]-N*1*-[(S)-2-cyclohexyl-1-(4-dimethylamino-butylcarbamoyl)-ethyl]-N*4*-hydroxy-succinamide | CHEMBL327472
Type:
Small organic molecule
Emp. Form.:
C28H45ClN4O4
Mol. Mass.:
537.134
SMILES:
CN(C)CCCCNC(=O)[C@H](CC1CCCCC1)NC(=O)[C@H](CCCc1ccc(Cl)cc1)CC(=O)NO
: