Target
72 kDa type IV collagenase
Ligand
BDBM50101494
Substrate
Meas. Tech.
ChEBML_101923
Ki
0.100000±n/a nM
Citation
 Porter, JRBeeley, NRBoyce, BAMason, BMillican, AMillar, KLeonard, JMorphy, JRO'Connell, JP Potent and selective inhibitors of gelatinase-a 1. hydroxamic acid derivatives Bioorg Med Chem Lett 4:2741-2746 (1994)    Article 
Target
Name:
72 kDa type IV collagenase
Synonyms:
72 kDa gelatinase CLG4A Gelatinase A (MMP-2) MMP2_HUMAN Matrix metalloproteinase-2 (MMP 2) Matrix metalloproteinases 2 (MMP-2) | TBE-1
Type:
Enzyme
Mol. Mass.:
73870.36
Organism:
Homo sapiens (Human)
Description:
P08253
Residue:
660
  
Inhibitor
Name:
BDBM50101494
Synonyms:
(R)-N*1*-((S)-2-Cyclohexyl-1-phenethylcarbamoyl-ethyl)-2-[3-(4-ethyl-phenyl)-propyl]-N*4*-hydroxy-succinamide N*1*-(2-Cyclohexyl-1-phenethylcarbamoyl-ethyl)-2-[3-(4-ethyl-phenyl)-propyl]-N*4*-hydroxy-succinamide
Type:
Small organic molecule
Emp. Form.:
C32H45N3O4
Mol. Mass.:
535.7174
SMILES:
CCc1ccc(CCC[C@H](CC(=O)NO)C(=O)N[C@@H](CC2CCCCC2)C(=O)NCCc2ccccc2)cc1
: