Target
72 kDa type IV collagenase
Ligand
BDBM50283711
Substrate
Meas. Tech.
ChEBML_101923
Ki
0.020000±n/a nM
Citation
 Porter, JRBeeley, NRBoyce, BAMason, BMillican, AMillar, KLeonard, JMorphy, JRO'Connell, JP Potent and selective inhibitors of gelatinase-a 1. hydroxamic acid derivatives Bioorg Med Chem Lett 4:2741-2746 (1994)    Article 
Target
Name:
72 kDa type IV collagenase
Synonyms:
72 kDa gelatinase CLG4A Gelatinase A (MMP-2) MMP2_HUMAN Matrix metalloproteinase-2 (MMP 2) Matrix metalloproteinases 2 (MMP-2) | TBE-1
Type:
Enzyme
Mol. Mass.:
73870.36
Organism:
Homo sapiens (Human)
Description:
P08253
Residue:
660
  
Inhibitor
Name:
BDBM50283711
Synonyms:
(R)-2-[3-(4-Chloro-phenyl)-propyl]-N*1*-[(S)-2-cyclohexyl-1-(3-morpholin-4-yl-3-oxo-propylcarbamoyl)-ethyl]-N*4*-hydroxy-succinamide | CHEMBL93235
Type:
Small organic molecule
Emp. Form.:
C29H43ClN4O6
Mol. Mass.:
579.128
SMILES:
ONC(=O)C[C@@H](CCCc1ccc(Cl)cc1)C(=O)N[C@@H](CC1CCCCC1)C(=O)NCCC(=O)N1CCOCC1
: