Target
Substance-P receptor
Ligand
BDBM50284050
Substrate
Meas. Tech.
ChEBML_205407
IC50
70.0±n/a nM
Citation
 Achard, ATruchon, APeyronel, JF Perhydrothiopyranopyrroles derivatives : A novel series of potent and selective nonpeptide NK1 antagonists. Bioorg Med Chem Lett 4:669-672 (1994)    Article 
Target
Name:
Substance-P receptor
Synonyms:
NK-1 receptor NK1 Receptor NK1R_HUMAN Neurokinin-1 (NK-1) SPR TACR1 Tachykinin receptor 1 (NK1) | tachykinin
Type:
G Protein-Coupled Receptor (GPCR)
Mol. Mass.:
46254.43
Organism:
Homo sapiens (Human)
Description:
P25103
Residue:
407
  
Inhibitor
Name:
BDBM50284050
Synonyms:
(S)-2-(2-Methoxy-phenyl)-1-((R)-1-oxo-4,4-diphenyl-octahydro-1lambda*4*-thiopyrano[2,3-c]pyrrol-6-yl)-propan-1-one RP-73467 | RP-73647
Type:
Small organic molecule
Emp. Form.:
C29H31NO3S
Mol. Mass.:
473.626
SMILES:
COc1ccccc1[C@H](C)C(=O)N1CC2[C@@H](C1)C(CCS2=O)(c1ccccc1)c1ccccc1
: