Target
Chymotrypsinogen B
Ligand
BDBM50284625
Substrate
Meas. Tech.
ChEMBL_216623 (CHEMBL819195)
Ki
2550±n/a nM
Citation
 Kim, DHRyoo, JJ (3R, 4S)-3-Benzyl-4-bromomethyloxetan-2-one, a fast acting alternate substrate inhibitor of α-chymotrypsin Bioorg Med Chem Lett 5:1287-1292 (1995)    Article 
Target
Name:
Chymotrypsinogen B
Synonyms:
A0A2R8YG87_HUMAN CTRB1 Chymotrypsin B chain B Chymotrypsinogen B
Type:
PROTEIN
Mol. Mass.:
27871.19
Organism:
Homo sapiens (Human)
Description:
ChEMBL_216634
Residue:
263
  
Inhibitor
Name:
BDBM50284625
Synonyms:
(3R,4S)-3-Benzyl-4-bromomethyl-oxetan-2-one | CHEMBL26280
Type:
Small organic molecule
Emp. Form.:
C11H11BrO2
Mol. Mass.:
255.108
SMILES:
BrC[C@H]1OC(=O)[C@@H]1Cc1ccccc1
: