Target
Cysteinyl leukotriene receptor 1
Ligand
BDBM50013920
Substrate
Meas. Tech.
ChEBML_98639
IC50
3.9±n/a nM
Citation
 Lau, CKDufresne, CGareau, YZamboni, RLabelle, MYoung, RNMetters, KMRochette, CSawyer, NSlipetz, DMCharette, LJones, TMcAuliffe, MMcFarlane, CFord-Hutchinson, AW Evolution of a series of non-quinoline leukotriene D4 receptor antagonist; synthesis and sar of benzothiazoles and thiazoles substituted benzyl alcohols as potent LTD4 antagonists Bioorg Med Chem Lett 5:1615-1620 (1995)    Article 
Target
Name:
Cysteinyl leukotriene receptor 1
Synonyms:
CLTR1_CAVPO | CYSLTR1
Type:
Enzyme Catalytic Domain
Mol. Mass.:
39007.58
Organism:
GUINEA PIG
Description:
Leukotriene D4 0 GUINEA PIG::Q2NNR5
Residue:
340
  
Inhibitor
Name:
BDBM50013920
Synonyms:
3-[(R)-{3-[(E)-2-(7-Chloro-quinolin-2-yl)-vinyl]-phenyl}-(2-dimethylcarbamoyl-ethylsulfanyl)-methylsulfanyl]-propionic acid CHEMBL280481 VERLUKAST
Type:
Small organic molecule
Emp. Form.:
C26H27ClN2O3S2
Mol. Mass.:
515.087
SMILES:
CN(C)C(=O)CCS[C@H](SCCC(O)=O)c1cccc(\C=C\c2ccc3ccc(Cl)cc3n2)c1
: