Target
Cholesteryl ester transfer protein
Ligand
BDBM50285079
Substrate
Meas. Tech.
ChEBML_48937
IC50
5200±n/a nM
Citation
 Chackalamannil, SXia, YWang, YTsai, HCzarniecki, MWang, SClemmons, AAhn, HSBoykow, G Novel inhibitors of cholesteryl ester transfer protein Bioorg Med Chem Lett 5:2005-2010 (1995)    Article 
Target
Name:
Cholesteryl ester transfer protein
Synonyms:
CETP Cholesteryl ester transfer protein (CETP) | Lipid transfer protein I
Type:
Enzyme
Mol. Mass.:
54751.53
Organism:
Homo sapiens (Human)
Description:
P11597
Residue:
493
  
Inhibitor
Name:
BDBM50285079
Synonyms:
4-Methoxy-3-((S)-2,5,5,8a-tetramethyl-3,4,4a,5,6,7,8,8a-octahydro-naphthalen-1-ylmethyl)-benzene-1,2-diol | CHEMBL64152
Type:
Small organic molecule
Emp. Form.:
C22H32O3
Mol. Mass.:
344.4877
SMILES:
COc1ccc(O)c(O)c1CC1=C(C)CCC2C(C)(C)CCC[C@]12C
: