Target
Cholesteryl ester transfer protein
Ligand
BDBM50285084
Substrate
Meas. Tech.
ChEBML_48937
IC50
16000±n/a nM
Citation
 Chackalamannil, SXia, YWang, YTsai, HCzarniecki, MWang, SClemmons, AAhn, HSBoykow, G Novel inhibitors of cholesteryl ester transfer protein Bioorg Med Chem Lett 5:2005-2010 (1995)    Article 
Target
Name:
Cholesteryl ester transfer protein
Synonyms:
CETP Cholesteryl ester transfer protein (CETP) | Lipid transfer protein I
Type:
Enzyme
Mol. Mass.:
54751.53
Organism:
Homo sapiens (Human)
Description:
P11597
Residue:
493
  
Inhibitor
Name:
BDBM50285084
Synonyms:
3-((S)-2,5,5,8a-Tetramethyl-3,4,4a,5,6,7,8,8a-octahydro-naphthalen-1-ylmethyl)-benzene-1,2-diol | CHEMBL57902
Type:
Small organic molecule
Emp. Form.:
C21H30O2
Mol. Mass.:
314.4617
SMILES:
CC1=C(Cc2cccc(O)c2O)[C@@]2(C)CCCC(C)(C)C2CC1
: