Target
Cholesteryl ester transfer protein
Ligand
BDBM50285085
Substrate
Meas. Tech.
ChEBML_48937
IC50
18000±n/a nM
Citation
 Chackalamannil, SXia, YWang, YTsai, HCzarniecki, MWang, SClemmons, AAhn, HSBoykow, G Novel inhibitors of cholesteryl ester transfer protein Bioorg Med Chem Lett 5:2005-2010 (1995)    Article 
Target
Name:
Cholesteryl ester transfer protein
Synonyms:
CETP Cholesteryl ester transfer protein (CETP) | Lipid transfer protein I
Type:
Enzyme
Mol. Mass.:
54751.53
Organism:
Homo sapiens (Human)
Description:
P11597
Residue:
493
  
Inhibitor
Name:
BDBM50285085
Synonyms:
4-Methoxy-3-naphthalen-2-ylmethyl-benzene-1,2-diol | CHEMBL64783
Type:
Small organic molecule
Emp. Form.:
C18H16O3
Mol. Mass.:
280.3178
SMILES:
COc1ccc(O)c(O)c1Cc1ccc2ccccc2c1
: