Target
Prostaglandin G/H synthase 1
Ligand
BDBM50029600
Substrate
Meas. Tech.
ChEBML_51690
IC50
600±n/a nM
Citation
 Leblanc, YGauthier, JEthier, DGuay, JMancini, JRiendeau, DTagari, PVickers, PWong, EPrasit, P Synthesis and biological evaluation of 2,3-diarylthiophenes as selective Cox-2 and Cox-1 inhibitors Bioorg Med Chem Lett 5:2123-2128 (1995)    Article 
Target
Name:
Prostaglandin G/H synthase 1
Synonyms:
COX-1 Cyclooxygenase Cyclooxygenase-1 (COX-1) PTGS1 | Prostaglandin G/H synthase (cyclooxygenase)
Type:
Enzyme
Mol. Mass.:
68692.62
Organism:
Homo sapiens (Human)
Description:
P23219
Residue:
599
  
Inhibitor
Name:
BDBM50029600
Synonyms:
5-Bromo-2-(4-fluoro-phenyl)-3-(4-methanesulfonyl-phenyl)-thiophene CHEMBL42485 | DUP-697
Type:
Small organic molecule
Emp. Form.:
C17H12BrFO2S2
Mol. Mass.:
411.308
SMILES:
CS(=O)(=O)c1ccc(cc1)-c1cc(Br)sc1-c1ccc(F)cc1
: