Target
Delta-type opioid receptor
Ligand
BDBM50286106
Substrate
Meas. Tech.
ChEBML_53437
IC50
0.320000±n/a nM
Citation
 Husbands, SMLewis, JW Morphinan cyclic imines and pyrrolidines containing a constrained phenyl group: High affinity opioid agonists Bioorg Med Chem Lett 5:2969-2974 (1995)    Article 
Target
Name:
Delta-type opioid receptor
Synonyms:
D-OR-1 Delta opioid receptor OPIATE Delta OPRD1 OPRK1 | opioid receptor, delta 1
Type:
G Protein-Coupled Receptor (GPCR)
Mol. Mass.:
40382.98
Organism:
Homo sapiens (Human)
Description:
Competition binding assays were carried out using membrane preparations from transfected HN9.10 cells that constitutively expressed the delta opioid receptor.
Residue:
372
  
Inhibitor
Name:
BDBM50286106
Synonyms:
CHEMBL321570 | Morphinan Cyclic Imine analogue
Type:
Small organic molecule
Emp. Form.:
C28H32N2O2
Mol. Mass.:
428.5659
SMILES:
COC12C=CC34C[C@@]1(C)[C@@H](N[C@H]2C31CCN(C)C4Cc2ccc(O)cc12)c1ccccc1
: