Target
Bile salt-activated lipase
Ligand
BDBM50286880
Substrate
Meas. Tech.
ChEMBL_154778 (CHEMBL761498)
Ki
9000±n/a nM
Citation
 Lin, GLiu, HCTsai, YC Atropisomeric carbamoyl type inhibitors of pancreatic cholesterol esterase Bioorg Med Chem Lett 6:43-46 (1996)    Article 
Target
Name:
Bile salt-activated lipase
Synonyms:
CEL Cholesterol esterase
Type:
PROTEIN
Mol. Mass.:
65152.77
Organism:
Bos taurus
Description:
ChEMBL_154778
Residue:
597
  
Inhibitor
Name:
BDBM50286880
Synonyms:
Butyric acid 2'-butylcarbamoyloxy-[1,1']binaphthalenyl-2-yl ester | CHEMBL139598
Type:
Small organic molecule
Emp. Form.:
C29H29NO4
Mol. Mass.:
455.5449
SMILES:
CCCCNC(=O)Oc1ccc2ccccc2c1-c1c(OC(=O)CCC)ccc2ccccc12
: