Target
Lysosomal acid lipase/cholesteryl ester hydrolase
Ligand
BDBM50287471
Substrate
Meas. Tech.
ChEBML_154781
IC50
10000±n/a nM
Citation
 David, BSchuber, F Synthesis of α-difluoro and α-difluoro-β-trifluoroketo-derivatives as potential inhibitors for Cholesterol Ester Hydrolase Bioorg Med Chem Lett 6:1673-1676 (1996)    Article 
Target
Name:
Lysosomal acid lipase/cholesteryl ester hydrolase
Synonyms:
LICH_HUMAN | LIPA
Type:
PROTEIN
Mol. Mass.:
45422.01
Organism:
Homo sapiens (Human)
Description:
ChEMBL_633497
Residue:
399
  
Inhibitor
Name:
BDBM50287471
Synonyms:
1-(4-tert-Butyl-cyclohexyl)-3,3,4,4,4-pentafluoro-butan-2-one | CHEMBL296516
Type:
Small organic molecule
Emp. Form.:
C14H21F5O
Mol. Mass.:
300.308
SMILES:
CC(C)(C)[C@H]1CC[C@H](CC(=O)C(F)(F)C(F)(F)F)CC1
: