Target
Protein kinase C epsilon type
Ligand
BDBM3199
Substrate
Meas. Tech.
ChEMBL_153151 (CHEMBL761874)
IC50
120±n/a nM
Citation
 Jr., GEDefauw, JMLampe, JWDarges, JWKalter, K Potent and selective PKC inhibitory 5-membered ring analogs of balanol with replacement of the carboxamide moiety Bioorg Med Chem Lett 6:1759-1764 (1996)    Article 
Target
Name:
Protein kinase C epsilon type
Synonyms:
KPCE_HUMAN PKCE Protein kinase C epsilon Protein kinase C, PKC; classical/novel nPKC-epsilon
Type:
Enzyme
Mol. Mass.:
83680.45
Organism:
Homo sapiens (Human)
Description:
The recombinant human PKC enzymes were produced using a baculovirus expression system in SF9 cells
Residue:
737
  
Inhibitor
Name:
BDBM3199
Synonyms:
(+-)-anti-2-[[2,6-Dihydroxy-4-[[[2-(4-hydroxybenzyl)cyclopentyl]oxy]carbonyl]phenyl]carbonyl]-3-hydroxybenzoic acid Acyclic Balanol Analog 29b
Type:
Small organic molecule
Emp. Form.:
C27H24O9
Mol. Mass.:
492.4741
SMILES:
OC(=O)c1cccc(O)c1C(=O)c1c(O)cc(cc1O)C(=O)O[C@@H]1CCC[C@H]1Cc1ccc(O)cc1
: