Target
Retinoic acid receptor RXR-alpha
Ligand
BDBM50403583
Substrate
Meas. Tech.
ChEMBL_196501 (CHEMBL798315)
Kd
>1000±n/a nM
Citation
 Vuligonda, VLin, YChandraratna, RA Synthesis of highly potent RXR-specific retinoids: The use of a cyclopropyl group as a double bond isostere Bioorg Med Chem Lett 6:213-218 (1996)    Article 
Target
Name:
Retinoic acid receptor RXR-alpha
Synonyms:
NR2B1 Nuclear receptor subfamily 4 group A member 2 RXRA Retinoic acid receptor RXR-alpha/gamma Retinoid receptor
Type:
PROTEIN
Mol. Mass.:
50820.38
Organism:
Homo sapiens (Human)
Description:
ChEMBL_1456363
Residue:
462
  
Inhibitor
Name:
BDBM50403583
Synonyms:
CHEMBL2111535
Type:
Small organic molecule
Emp. Form.:
C24H32O2
Mol. Mass.:
352.5097
SMILES:
C\C(\C=C\C1CC1(C)c1ccc2c(c1)C(C)(C)CCC2(C)C)=C\C(O)=O
: