Target
Retinoic acid receptor gamma
Ligand
BDBM31892
Substrate
Meas. Tech.
ChEBML_196177
Kd
22±n/a nM
Citation
 Vuligonda, VLin, YChandraratna, RA Synthesis of highly potent RXR-specific retinoids: The use of a cyclopropyl group as a double bond isostere Bioorg Med Chem Lett 6:213-218 (1996)    Article 
Target
Name:
Retinoic acid receptor gamma
Synonyms:
NR1B3 RAR-gamma RARG_HUMAN Retinoic acid receptor gamma | Retinoid receptor
Type:
PROTEIN
Mol. Mass.:
50345.43
Organism:
Homo sapiens (Human)
Description:
ChEMBL_1458016
Residue:
454
  
Inhibitor
Name:
BDBM31892
Synonyms:
9-cis retinoic acid CHEMBL705 alitretinoin
Type:
Small organic molecule
Emp. Form.:
C20H28O2
Mol. Mass.:
300.4351
SMILES:
C\C(\C=C\C1=C(C)CCCC1(C)C)=C\C=C\C(\C)=C\C(O)=O
: