Target
Subtilisin BL
Ligand
BDBM26142
Substrate
Meas. Tech.
ChEMBL_98918 (CHEMBL708727)
Ki
95000±n/a nM
Citation
 Stabile, MRLai, WGDeSantis, GGold, MJones, JBMitchinson, CBott, RRGraycar, TPLiu, CC Probing the specificity of the S1 binding site of M222 mutants of subtilisin B. lentus with boronic acid inhibitors Bioorg Med Chem Lett 6:2501-2506 (1996)    Article 
Target
Name:
Subtilisin BL
Synonyms:
SUBB_LEDLE | Subtilisin
Type:
PROTEIN
Mol. Mass.:
26829.89
Organism:
Bacillus lentus
Description:
ChEMBL_197707
Residue:
269
  
Inhibitor
Name:
BDBM26142
Synonyms:
(2-phenylethyl)boranediol | Alkylboronic Acid, 21
Type:
Small organic molecule
Emp. Form.:
C8H11BO2
Mol. Mass.:
149.983
SMILES:
OB(O)CCc1ccccc1
: