Target
Prolyl endopeptidase
Ligand
BDBM50289641
Substrate
Meas. Tech.
ChEBML_157480
IC50
904±n/a nM
Citation
 Károly, KSándor, EsEdit, SMiklós, FJudit, SBenjámin, PAndrea, SIstván, H Prolyl endopeptidase inhibitors1: N-acyl derivatives of L-thioproline-pyrrolidine Bioorg Med Chem Lett 7:1701-1704 (1997)    Article 
Target
Name:
Prolyl endopeptidase
Synonyms:
PPCE_RAT | Prep
Type:
PROTEIN
Mol. Mass.:
80731.99
Organism:
Rattus norvegicus
Description:
ChEMBL_1336163
Residue:
710
  
Inhibitor
Name:
BDBM50289641
Synonyms:
1-[(R)-4-(Pyrrolidine-1-carbonyl)-thiazolidin-3-yl]-octadecan-1-one | CHEMBL50764
Type:
Small organic molecule
Emp. Form.:
C26H48N2O2S
Mol. Mass.:
452.737
SMILES:
CCCCCCCCCCCCCCCCCC(=O)N1CSC[C@H]1C(=O)N1CCCC1
: