Target
Prolyl endopeptidase
Ligand
BDBM50289646
Substrate
Meas. Tech.
ChEBML_157480
IC50
73±n/a nM
Citation
 Károly, KSándor, EsEdit, SMiklós, FJudit, SBenjámin, PAndrea, SIstván, H Prolyl endopeptidase inhibitors1: N-acyl derivatives of L-thioproline-pyrrolidine Bioorg Med Chem Lett 7:1701-1704 (1997)    Article 
Target
Name:
Prolyl endopeptidase
Synonyms:
PPCE_RAT | Prep
Type:
PROTEIN
Mol. Mass.:
80731.99
Organism:
Rattus norvegicus
Description:
ChEMBL_1336163
Residue:
710
  
Inhibitor
Name:
BDBM50289646
Synonyms:
(E)-2-Methyl-1-[(S)-2-(pyrrolidine-1-carbonyl)-pyrrolidin-1-yl]-oct-2-en-1-one | CHEMBL297237
Type:
Small organic molecule
Emp. Form.:
C18H30N2O2
Mol. Mass.:
306.443
SMILES:
CCCCC\C=C(/C)C(=O)N1CCC[C@H]1C(=O)N1CCCC1
: