Target
Retinoic acid receptor RXR-beta
Ligand
BDBM50290186
Substrate
Meas. Tech.
ChEMBL_197070 (CHEMBL806659)
Ki
10±n/a nM
Citation
 Farmer, LJJeong, SKallel, EAKoch, SSCroston, GEFlatten, KSHeyman, RANadzan, AM Synthesis and structure-activity relationships of potent retinoid X receptor ligands Bioorg Med Chem Lett 7:2393-2398 (1997)    Article 
Target
Name:
Retinoic acid receptor RXR-beta
Synonyms:
Nr2b2 Retinoid X receptor beta | Rxrb
Type:
PROTEIN
Mol. Mass.:
55877.78
Organism:
Mus musculus
Description:
ChEMBL_196588
Residue:
520
  
Inhibitor
Name:
BDBM50290186
Synonyms:
(2E,4E)-3-Methyl-5-[(1R,2R)-1-methyl-2-(5,5,8,8-tetramethyl-5,6,7,8-tetrahydro-naphthalen-2-yl)-cyclopentyl]-penta-2,4-dienoic acid | CHEMBL312395
Type:
Small organic molecule
Emp. Form.:
C26H36O2
Mol. Mass.:
380.5628
SMILES:
C\C(\C=C\[C@@]1(C)CCC[C@@H]1c1ccc2c(c1)C(C)(C)CCC2(C)C)=C/C(O)=O
: