Target
Acetylcholinesterase
Ligand
BDBM50089616
Substrate
Meas. Tech.
ChEMBL_546878 (CHEMBL1029214)
IC50
260±n/a nM
Citation
 Peng, FC Structure and anti-acetylcholinesterase activity of 4 alpha-(hydroxymethyl)-4 alpha-demethylterritrem B. J Nat Prod 60:842-3 (1997)  
Target
Name:
Acetylcholinesterase
Synonyms:
ACES_ELEEL Acetylcholinesterase (EeAChE) | ache
Type:
Enzyme
Mol. Mass.:
71812.79
Organism:
Electrophorus electricus (Electric eel)
Description:
Residue:
633
  
Inhibitor
Name:
BDBM50089616
Synonyms:
4a,12a-Dihydroxy-4,4,6a,12b-tetramethyl-9-(3,4,5-trimethoxy-phenyl)-4a,6,6a,12,12a,12b-hexahydro-4H,5H-7,10-dioxa-benzo[a]anthracene-1,11-dione territrem B
Type:
Small organic molecule
Emp. Form.:
C29H34O9
Mol. Mass.:
526.5749
SMILES:
COc1cc(cc(OC)c1OC)-c1cc2O[C@]3(C)CC[C@@]4(O)C(C)(C)C=CC(=O)[C@]4(C)[C@@]3(O)Cc2c(=O)o1
: